درزه‏های سامانمند
type: Concept
broader: درزه
preferred label: systematic joints @en
scope note: درزه‌هایی با ویژگی‌های مشابه که در یک یا چند دسته ظاهر می‌شوند

درزه
type: Concept
narrower: درزه‏های سامانمند
preferred label: joint @en