شکستگی‌های سامانمند
type: Concept
broader: شکستگی
preferred label: systematic fractures @en
scope note: شکستگی‌هایی با ویژگی‌های مشابه که در یک یا چند دسته ظاهر می‌شوند

شکستگی
type: Concept
narrower: شکستگی‌های سامانمند
preferred label: fracture(structural geology) @en