پکتولیت
type: Concept
broader: سیلیکات زنجیره ای
preferred label: pectolite @en
scope note: سیلیکات زنجیره‌ای، دارای سیستم تبلور تری کلینیک-درجه سختی 5-چگالی 7/2 تا 8/2 از کانیهای گروه زئولیت، بیرنگ یا کمرنگ سفید

سیلیکات زنجیره ای
type: Concept
narrower: پکتولیت
preferred label: chain silicate @en