کلینوانستاتیت
type: Concept
preferred label: clinoenstatite @en
related: کلینوهیپرستن

کلینوهیپرستن
type: Concept
broader: کلینوپیروکسن
preferred label: clinohypersthene @en
related: کلینوانستاتیت
scope note: ممکن است بعنوان یک ترکیب میانه بین کلینوانستاتیت و کلینوفروسیلیت در نظر گرفته شود

کلینوپیروکسن
type: Concept
narrower: کلینوهیپرستن
preferred label: clinopyroxene @en