آلومینوسیلیکات‌ها
type: Concept
preferred label: aluminosilicates @en
related: پمپلئیت

پمپلئیت
type: Concept
broader: سوروسیلیکات
preferred label: pumpellyite @en
related: آلومینوسیلیکات‌ها
scope note: از سوروسیلیکاتهای گروه ایدوکراز که در سیستم منوکلین متبلور می شود، بصورت منشورهای طویل و یا فیبری، برنگ سبز مایل به آبی، درجه سختی 6 و چگالی 23/3-18/3 می باشد و در شیست‌های آبی و شیست‌های گلوکوفان‌دار دیده می شود

سوروسیلیکات
type: Concept
narrower: پمپلئیت
preferred label: sorosilicate @en