ملانیت
type: Concept
broader: گروه گارنت
preferred label: melanite @en
scope note: نوعی کانی سیاه رنگ آندزیت- گارنت- لعل سیاه- حجر سیلان سیاه

گروه گارنت
type: Concept
narrower: ملانیت
preferred label: garnet Group @en