سیستم چهارگوش
type: Concept
alternative label: سیستم چهارگوشه‌ای
broader: سیستم بلوری
preferred label: tetragonal system @en
related: بلورنگاری
scope note: یکی از شش سیستم بلوری که با سه محور عمودبرهم مشخص می‌شود و محور قائم آن دارای چرخش چهارتایه است و دو محور افقی آن طول همسان دارند

سیستم بلوری
type: Concept
narrower: سیستم چهارگوش
preferred label: crystal system @en

بلورنگاری
type: Concept
preferred label: crystallography @en
related: سیستم چهارگوش