اپسومیت
type: Concept
broader: سولفات‌ها
preferred label: epsomite @en
scope note: سولفات منیزیم که در قشر مارنهای دولومیتی مشاهده می شود.

سولفات‌ها
type: Concept
narrower: اپسومیت
preferred label: sulfate @en