پلی‌هالیت
type: Concept
broader: سولفات‌ها
preferred label: polyhalite @en
scope note: سولفات سه گانه آبدار پتاسیم، منیزیم و کلسیم که به رنگهای صورتی، قرمز و خاکستری یافت می شود

سولفات‌ها
type: Concept
narrower: پلی‌هالیت
preferred label: sulfate @en