پُوِرکان
type: Concept
broader: پالئوسن زیرین
preferred label: Puercan @en
scope note: اشکوب قاره‌ای آمریکای شمالی. بالای کرتاسه و زیر دراگونین

پالئوسن زیرین
type: Concept
narrower: پُوِرکان
preferred label: lower Paleocene @en