ایروینگتونین
type: Concept
broader: پلیستوسن
preferred label: Irvingtonian @en
scope note: آمریکای شمالی. بالای بلنکن و زیر رنچولابرین. اشکوب قاره‌ای.

پلیستوسن
type: Concept
narrower: ایروینگتونین
preferred label: Pleistocene @en