آفتونین
type: Concept
broader: پلیستوسن زیرین
preferred label: Aftonian @en
scope note: مدت زمان فاصله بین دوره های یخچالی در شمال آمریکا

پلیستوسن زیرین
type: Concept
narrower: آفتونین
preferred label: lower Pleistocene @en