توف بی شاپ
type: Concept
broader: پلیستوسن
preferred label: Bishop Tuff @en
related: کالیفرنیا
scope note: شرق مرکز کالیفرنیا. توف بی شاپ در زمانی کوتاه پس از اشکوب یخچالی شروین فوران نموده است

پلیستوسن
type: Concept
narrower: توف بی شاپ
preferred label: Pleistocene @en

کالیفرنیا
type: Concept
preferred label: California @en
related: توف بی شاپ