رس خلیج بوتلگر
type: Concept
broader: پلیستوسن
preferred label: Bootlegger Cove Clay @en
related: آلاسکا
scope note: نیک را از نهشته های یخچالی ناپتون روپوشانی شده جدا می کند.

پلیستوسن
type: Concept
narrower: رس خلیج بوتلگر
preferred label: Pleistocene @en

آلاسکا
type: Concept
preferred label: Alaska @en
related: رس خلیج بوتلگر