سازند سانتاباربارا
type: Concept
broader: پلیستوسن
preferred label: Santa Barbara Formation @en
related: کالیفرنیا
scope note: پلیوسن جنوب کالیفرنیا. همچنین برای محلهای مختلفی در آمریکای جنوبی استفاده می‌شود.

پلیستوسن
type: Concept
narrower: سازند سانتاباربارا
preferred label: Pleistocene @en

کالیفرنیا
type: Concept
preferred label: California @en
related: سازند سانتاباربارا