سنگامونین
type: Concept
preferred label: Sangamonian @en
related: میان دوره یخچالی ریس-وُرم

میان دوره یخچالی ریس-وُرم
type: Concept
broader: پلیستوسن
preferred label: Riss/Wurm Interglacial @en
related: سنگامونین
scope note: اروپا. واژه‌ای که در مورد آلپ برای اشکوب سوم بین یخچالی دوران پلیستوسن، پس از اشکوب یخچالی ریس و قبل از وُرم بکار می‌رود.

پلیستوسن
type: Concept
narrower: میان دوره یخچالی ریس-وُرم
preferred label: Pleistocene @en