سنگ‌شناسی تجربی
type: Concept
preferred label: experimental petrology @en
related: سنگ‌شناسی
scope note: شاخه‌ای از سنگ‌شناسی که به مطالعۀ آزمایشگاهی واکنش‌های طراحی‌شده برای مشخص‌کردن فرایندهای سنگ‌ساز می‌پردازد

سنگ‌شناسی
type: Concept
preferred label: petrology @en
related: سنگ‌شناسی تجربی