مصالح دانه‌درشت
type: Concept
broader: سنگدانه
preferred label: coarse aggregate @en
scope note: مصالح دانه‌ای با ذرات بزرگ‌تر از 4/76 میلی‌متر

سنگدانه
type: Concept
narrower: مصالح دانه‌درشت
preferred label: aggregate(sedimentology) @en