سنگ نفوذی
type: Concept
alternative label: سنگ درونی
preferred label: intrusive rock @en
related: سنگ
related: سنگ آذرین
scope note: سنگ آذرینی که در سنگ‌های قدیمی‏تر از خود نفوذ کرده باشد

سنگ آذرین
type: Concept
preferred label: igneous rock @en
related: سنگ نفوذی

سنگ
type: Concept
preferred label: rock @en
related: سنگ نفوذی