نوع سنگ
type: Concept
preferred label: lithotype @en
related: زغال‌سنگ پوده‌گلی

زغال‌سنگ پوده‌گلی
type: Concept
alternative label: زغال‌سنگ ساپروپلی
broader: زغال‌سنگ
preferred label: sapropelite @en
related: نوع سنگ
scope note: سنگ ساپروپلیتی، گل و لای ساپروپل داری که تحت تأثیر پدیده دیاژنز سخت و سفت شده است

زغال‌سنگ
type: Concept
narrower: زغال‌سنگ پوده‌گلی
preferred label: coal @en