زغال‌سنگ تولید بخار
type: Concept
broader: زغال‌سنگ
preferred label: steam coal @en
scope note: زغال‌سنگی که برای تولید بخار آب مناسب است.

زغال‌سنگ
type: Concept
narrower: زغال‌سنگ تولید بخار
preferred label: coal @en