کک طبیعی
type: Concept
broader: زغال‌سنگ
preferred label: coke coal @en
scope note: فرآورده چگال حاصل از کربنی کردن زغال‌سنگ در نوعی کوره است. رنگ کک از توده سیاه تا ماده ای نقره ای درخشان تغییر می یابد. بعنوان سوخت و عامل کاهنده در کوره های بلند، برای تولید گاز بکار برده می شود.

زغال‌سنگ
type: Concept
narrower: کک طبیعی
preferred label: coal @en