سنگ‌ماسه کوارتزی
type: Concept
broader: سنگ‌ماسه
preferred label: quartz arenite @en
related: کوارتزیت رسوبی
scope note: ماسه‌سنگی فاقد خمیره یا با خمیرۀ اندک که بیش از 95 درصد آن را کوارتز تشکیل می‌دهد

سنگ‌ماسه
type: Concept
narrower: سنگ‌ماسه کوارتزی
preferred label: arenite @en

کوارتزیت رسوبی
type: Concept
preferred label: orthoquartzite @en
related: سنگ‌ماسه کوارتزی