سنگ آهک جلبکی
type: Concept
broader: سنگ آهک
preferred label: algal limestone @en
scope note: عموما در پالئوزوئیک(دوران) پیشین، بویژه در کامبرو- اردویسین در ناحیه آپالاچین آمریکا یافت می شود

سنگ آهک
type: Concept
narrower: سنگ آهک جلبکی
preferred label: limestone @en