سنگ آذرخش
type: Concept
broader: سنگ دگرگونی
preferred label: fulgurite @en
scope note: از ماسه‌های گداخته یا سنگ‌ها توسط آذرخش تشکیل شده است.

سنگ دگرگونی
type: Concept
narrower: سنگ آذرخش
preferred label: metamorphic rock @en