سنگ دگرگونی همبری
type: Concept
broader: سنگ دگرگونی
preferred label: contact metamorphic rock @en
scope note: سنگی که براثر فرایندهای دگرگونی همبری تشکیل می‌شود

سنگ دگرگونی
type: Concept
narrower: سنگ دگرگونی همبری
preferred label: metamorphic rock @en