آذرآوار فرعی
type: Concept
broader: آذرآواری
preferred label: accessory pyrcolast @en
scope note: آذرآواری متشکل از قطعات مخروط آتشفشانی یا گدازه‌های قدیمی‌تر

آذرآواری
type: Concept
narrower: آذرآوار فرعی
preferred label: pyroclastic @en