توف آبزاد
type: Concept
alternative label: نهشتۀ شیشه‌آواری
broader: آذرآواری
preferred label: hyaloclastite @en
scope note: نوعی سنگ آذرین پیروکلاستیک. سنگ‌های برشی دانه‌ریز که عناصر سازنده آن شیشه‌های آتشفشانی است و در گدازه‌های بالشی انباشته شده است.

آذرآواری
type: Concept
narrower: توف آبزاد
preferred label: pyroclastic @en