تل سنگ پا
type: Concept
broader: سنگ پا(نوعی سنگ)
preferred label: scoria mound @en
scope note: تپه‌ای آتشفشانی که از پوستۀ اخگری حفره‌دار بر روی سطح گدازۀ بازالتی یا آندزیتی تشکیل شده است

سنگ پا(نوعی سنگ)
type: Concept
narrower: تل سنگ پا
preferred label: scoria @en