لاتیت
type: Concept
broader: آندزیت تراکیتی
preferred label: latite @en
related: لاتیت کوارتزی
scope note: تراکی آندزیت. سنگ‌هایی که محتوی مقادیر نسبتاً مساوی از آلکالی ‌فلدسپات‌ها و پلاژیوکلازها می‌باشد.

آندزیت تراکیتی
type: Concept
narrower: لاتیت
preferred label: trachyandesite @en

لاتیت کوارتزی
type: Concept
preferred label: quartz latite @en
related: لاتیت