بازالت تراکیتی
type: Concept
preferred label: trachybasalt @en
related: تراکی دولریت

تراکی دولریت
type: Concept
broader: بازالت قلیایی
preferred label: trachydolerite @en
related: بازالت تراکیتی
scope note: نماینده دو گروه سنگهای تراکیتی و دولریتی (میکروگابروئی) که خصوصیات هر دو گروه را دارد

بازالت قلیایی
type: Concept
narrower: تراکی دولریت
preferred label: alkali basalt @en