پانتلریت(نوعی سنگ)
type: Concept
broader: ریولیت
preferred label: pantellerite @en
related: کومندیت
scope note: ریولیت قلیایی: نام یک سری از گدازه‌های مرز بین سنگهای آتشفشانی اسیدی و سنگهای حد واسط

کومندیت
type: Concept
preferred label: comendite @en
related: پانتلریت(نوعی سنگ)

ریولیت
type: Concept
narrower: پانتلریت(نوعی سنگ)
preferred label: rhyolite @en