تونالیت
type: Concept
broader: دیوریت
preferred label: tonalite @en
related: دیوریت کوارتزی
scope note: دیوریت کوارتزدار. نوعی سنگ دیوریت کوارتزدار که دارای بیش از 10 درصد کوارتز و پلاژیوکلاز است.

دیوریت کوارتزی
type: Concept
preferred label: quartz diorite @en
related: تونالیت

دیوریت
type: Concept
narrower: تونالیت
preferred label: diorite @en