سوویت
type: Concept
broader: کربناتیت
preferred label: sovite @en
scope note: سنگهای آذرین دانه داری که آهک حالت بلورین را داشته و 80% بلورهای سازنده آنرا بلورهای درشت کربنات تشکیل می دهد

کربناتیت
type: Concept
narrower: سوویت
preferred label: carbonatite @en