کوارتزولیت
type: Concept
broader: سنگ آذرین درونی
preferred label: quartzolite @en
scope note: رخدادهای سیلیسی در تشکیلات دریاچه‌ای یا مردابی که از کوارتزهای ثانوی که بر روی یکدیگر قرار دارند تشکیل شده است.

سنگ آذرین درونی
type: Concept
narrower: کوارتزولیت
preferred label: plutonic rock @en