رودینژیت
type: Concept
broader: گابرو
preferred label: rodingite @en
scope note: از سنگهای ماگمائی تیپ گابروئی که در اثر پدیده دگرگونی متاسوماتیک تغییر شکل یافته بوجود می‌آیند. با پاراژنزهای گروناگروسولردار، پیروکسن، پرهنیت و سرپنتین همراه است

گابرو
type: Concept
narrower: رودینژیت
preferred label: gabbro @en