فلسیت
type: Concept
broader: گرانیت
preferred label: felsite @en
related: ترکیب کوارتز و فلدسپات‌دار
scope note: سنگی شبیه سنگ چخماق و تماماً کوارتز و فلدسپات. سنگ ریولیتی که محتوی بلورهای ریز، ارتوز فیبری و کوارتز است.

گرانیت
type: Concept
narrower: فلسیت
preferred label: granite @en

ترکیب کوارتز و فلدسپات‌دار
type: Concept
preferred label: felsic composition @en
related: فلسیت