می‌نت
type: Concept
broader: لامپروفیر
preferred label: minette @en
scope note: ارتوکلاز- بیوتیت لامپروفیر. کان‌سنگ آهن دار که بصورت لایه های ائولیتی آهکی دیده می شود. سینیت غنی از میکای سیاه در ارتباط با کان‌سنگهای آهندار.

لامپروفیر
type: Concept
narrower: می‌نت
preferred label: lamprophyre @en