فرسایش
type: Concept
preferred label: erosion @en
related: سکوی فرسایشی

سکوی فرسایشی
type: Concept
preferred label: erosion platform @en
related: سکو
related: فرسایش
scope note: سطح نسبتاً تراز با گسترۀ محدودی که با فرسایش ساحلی شکل گرفته باشد

سکو
type: Concept
preferred label: platform @en
related: سکوی فرسایشی