سکوی سایشی
type: Concept
preferred label: abrasion platform @en
related: سکو
scope note: سطح میان‌کشندی پهناوری با شیب روبه‌دریا که براثر فرسایش طولانی‌مدت امواج به وجود آمده است

سکو
type: Concept
preferred label: platform @en
related: سکوی سایشی