سنگ آذرین
type: Concept
preferred label: igneous rock @en
related: سقف‌آویز

سقف‌آویز
type: Concept
preferred label: roof pendant @en
related: سنگ آذرین
scope note: بیرون‌زدگی روبه‌پایین سنگ درون‌گیر به درون تودۀ نفوذی آذرین