سد رودپیچ
type: Concept
preferred label: meander bar @en
related: سد
related: رودپیچ
scope note: نهشته‌ای از شن و ماسه که در سمت درونی رودپیچ قراردارد

سد
type: Concept
preferred label: dam @en
related: سد رودپیچ

رودپیچ
type: Concept
preferred label: meander @en
related: سد رودپیچ