گسل
type: Concept
preferred label: fault @en
related: نرمه گسل

برش
type: Concept
preferred label: breccia @en
related: نرمه گسل

نرمه گسل
type: Concept
preferred label: gouge @en
related: برش
related: گسل
scope note: لایه نازکی از مواد نرم که بین رگه معدنی و دیواره قرار گرفته است