بریتیش کلمبیا
type: Concept
preferred label: British Columbia @en
related: سازند خلیج عقاب

سازند خلیج عقاب
type: Concept
preferred label: Eagle Bay Formation @en
related: بریتیش کلمبیا
scope note: کامبرین- اردوویسیین؟تریاس؟ جنوب بریتیش کلمبیا