لایه‌بندی چلیپایی جناغی
type: Concept
broader: لایه‌بندی متقاطع
preferred label: herringbone cross bedding @en
scope note: نوعی لایه‌بندی چلیپایی که به‌صورت لایه‌های متناوب یا برهم‌نهشته در جهت‌های متفاوت شیب دارد و الگویی جناغی دارد

لایه‌بندی متقاطع
type: Concept
narrower: لایه‌بندی چلیپایی جناغی
preferred label: cross bedding @en