زنجیره آتشفشانی
type: Concept
preferred label: volcanic chain @en
related: آتشفشان
related: آتشفشانی
scope note: مجموعه‏ای از آتشفشان‌ها که تشکیل یک زنجیره یا خط می‌دهند

آتشفشانی
type: Concept
preferred label: volcanic @en
related: زنجیره آتشفشانی

آتشفشان
type: Concept
preferred label: volcano @en
related: زنجیره آتشفشانی