زمین‌لرزه 1976 فریولی
type: Concept
broader: زمین‌لرزه
preferred label: Friuli earthquake 1976 @en
related: ایتالیا
scope note: کانون زمین لرزه در فریولی-ونزیا گیولیا، شمال شرق ایتالیا.

زمین‌لرزه
type: Concept
narrower: زمین‌لرزه 1976 فریولی
preferred label: earthquake @en

ایتالیا
type: Concept
preferred label: Italy @en
related: زمین‌لرزه 1976 فریولی