زمین‌لرزه 1983 کولینگا
type: Concept
broader: زمین‌لرزه
preferred label: Coalinga earthquake 1983 @en
related: کالیفرنیا
scope note: کانون (مرکز) زمین لرزه نزدیک کولینگا در جنوب مرکز کالیفرنیا بوده است.

زمین‌لرزه
type: Concept
narrower: زمین‌لرزه 1983 کولینگا
preferred label: earthquake @en

کالیفرنیا
type: Concept
preferred label: California @en
related: زمین‌لرزه 1983 کولینگا