زمین‌شناسی ماه
type: Concept
preferred label: lunar geology @en
related: زمین‌شناسی
scope note: مطالعۀ کرۀ ماه به‌ویژه ترکیب و منشأ سیماهای سطح آن براساس اصول و روش‌های زمین‌شناختی

زمین‌شناسی
type: Concept
preferred label: geology @en
related: زمین‌شناسی ماه