نابرجایی
type: Concept
preferred label: allochtony @en
related: نابرجا
related: نابرجا زمین
scope note: انباشته ‏شدن مواد گیاهی در مکانی به‏جز محل رشد آنها

نابرجا زمین
type: Concept
preferred label: allochton @en
related: نابرجایی

نابرجا
type: Concept
preferred label: allochtonous @en
related: نابرجایی